{"text_format":"3","workbook":"xlsx","n_sheets":2,"sheets":["Base","Grille Comp"],"not_rendered":{"macros":1,"defined_names":4},"read":"whole","date_system":"1900"}

{"sheet":"Base","index":0,"n_rows":8,"n_cols":4,"rows_kept":8}
["Pays","Taille","Poids","Tarif"]
["P1","T1_2",50,{"$f":"OFFSET('Grille Comp'!$A$1,MATCH(C2,Liste_Poids(A2),1),MATCH(A2,'Grille Comp'!$1:$1,0)+MATCH(B2,Liste_Tailles(A2))-1,1,1)","v":1.12}]
["P2","T2_3",123,{"$f":"OFFSET('Grille Comp'!$A$1,MATCH(C3,Liste_Poids(A3),1),MATCH(A3,'Grille Comp'!$1:$1,0)+MATCH(B3,Liste_Tailles(A3))-1,1,1)","v":2.23}]
["P4","T4_4",345,{"$f":"OFFSET('Grille Comp'!$A$1,MATCH(C4,Liste_Poids(A4),1),MATCH(A4,'Grille Comp'!$1:$1,0)+MATCH(B4,Liste_Tailles(A4))-1,1,1)","v":4.4399999999999995}]
["P3","T3_5",555,{"$f":"OFFSET('Grille Comp'!$A$1,MATCH(C5,Liste_Poids(A5),1),MATCH(A5,'Grille Comp'!$1:$1,0)+MATCH(B5,Liste_Tailles(A5))-1,1,1)","v":3.6399999999999997}]
["P2","T2_5",657,{"$f":"OFFSET('Grille Comp'!$A$1,MATCH(C6,Liste_Poids(A6),1),MATCH(A6,'Grille Comp'!$1:$1,0)+MATCH(B6,Liste_Tailles(A6))-1,1,1)","v":2.75}]
["P3","T3_4",550,{"$f":"OFFSET('Grille Comp'!$A$1,MATCH(C7,Liste_Poids(A7),1),MATCH(A7,'Grille Comp'!$1:$1,0)+MATCH(B7,Liste_Tailles(A7))-1,1,1)","v":3.6399999999999997}]
["P1","T1_3",243,{"$f":"OFFSET('Grille Comp'!$A$1,MATCH(C8,Liste_Poids(A8),1),MATCH(A8,'Grille Comp'!$1:$1,0)+MATCH(B8,Liste_Tailles(A8))-1,1,1)","v":1.33}]

{"sheet":"Grille Comp","index":1,"n_rows":10,"n_cols":26,"rows_kept":10}
["P1","T1_1","T1_2","T1_3","T1_4",null,"P2","T2_1","T2_2","T2_3","T2_4","T2_5",null,"P3","T3_1","T3_2","T3_3","T3_4",null,"P4","T4_1","T4_2","T4_3","T4_4","T4_5","T4_6"]
[0,1.11,1.12,1.13,1.14,null,0,2.1100000000000003,2.12,2.13,2.1399999999999997,2.15,null,0,3.1100000000000003,3.12,3.13,3.1399999999999997,null,0,4.11,4.12,4.13,4.14,4.15,4.16]
[100,1.21,1.22,1.23,1.24,null,100,2.21,2.2199999999999998,2.23,2.24,2.25,null,100,3.21,3.2199999999999998,3.23,3.24,null,100,4.21,4.22,4.23,4.24,4.25,4.26]
[200,1.31,1.32,1.33,1.34,null,200,2.31,2.3200000000000003,2.33,2.34,2.35,null,200,3.31,3.3200000000000003,3.33,3.34,null,200,4.3100000000000005,4.32,4.33,4.34,4.35,4.36]
[300,1.41,1.42,1.43,1.44,null,300,2.41,2.42,2.4299999999999997,2.44,2.45,null,300,3.41,3.42,3.4299999999999997,3.44,null,300,4.41,4.42,4.43,4.4399999999999995,4.45,4.46]
[400,1.51,1.52,1.53,1.54,null,400,2.51,2.52,2.5300000000000002,2.54,2.55,null,400,3.51,3.52,3.5300000000000002,3.54,null,400,4.51,4.52,4.53,4.54,4.55,4.56]
[500,1.61,1.62,1.63,1.64,null,500,2.6100000000000003,2.62,2.63,2.6399999999999997,2.65,null,500,3.6100000000000003,3.62,3.63,3.6399999999999997,null,500,4.61,4.62,4.63,4.64,4.65,4.66]
[600,1.71,1.72,1.73,1.74,null,600,2.71,2.7199999999999998,2.73,2.74,2.75,null,600,3.71,3.7199999999999998,3.73,3.74,null,600,4.71,4.72,4.73,4.74,4.75,4.76]
[{"$nulls":6},700,2.81,2.82,2.83,2.84,2.85,{"$nulls":7},700,4.81,4.82,4.83,4.84,4.85,4.86]
[{"$nulls":19},800,4.91,4.92,4.93,4.94,4.95,4.96]